Target
P2Y purinoceptor 2
Ligand
BDBM50371571
Substrate
Meas. Tech.
ChEMBL_463782 (CHEMBL932171)
EC50
5470±n/a nM
Citation
 Douglass, JGPatel, RIYerxa, BRShaver, SRWatson, PSBednarski, KPlourde, RRedick, CCBrubaker, KJones, ACBoyer, JL Lipophilic modifications to dinucleoside polyphosphates and nucleotides that confer antagonist properties at the platelet P2Y12 receptor. J Med Chem 51:1007-25 (2008)  
Target
Name:
P2Y purinoceptor 2
Synonyms:
ATP receptor P2RY2 P2U purinoceptor 1 P2Y purinoceptor 2 Purinergic receptor | Purinergic receptor P2Y2
Type:
PROTEIN
Mol. Mass.:
42299.21
Organism:
Homo sapiens (Human)
Description:
ChEMBL_1455361
Residue:
377
  
Inhibitor
Name:
BDBM50371571
Synonyms:
CHEMBL1162181
Type:
Small organic molecule
Emp. Form.:
C34H40N6O25P4
Mol. Mass.:
1056.6016
SMILES:
CNc1ccccc1C(=O)O[C@@H]1[C@@H](COP(O)(=O)OP(O)(=O)OP(O)(=O)OP(O)(=O)OC[C@@H]2O[C@@H]([C@@H](OC(=O)c3ccccc3NC)[C@H]2O)n2ccc(=O)[nH]c2=O)O[C@H]([C@@H]1O)n1ccc(=O)[nH]c1=O
: