Target
P2Y purinoceptor 12
Ligand
BDBM50371570
Substrate
Meas. Tech.
ChEMBL_463779 (CHEMBL931130)
IC50
8290±n/a nM
Citation
 Douglass, JGPatel, RIYerxa, BRShaver, SRWatson, PSBednarski, KPlourde, RRedick, CCBrubaker, KJones, ACBoyer, JL Lipophilic modifications to dinucleoside polyphosphates and nucleotides that confer antagonist properties at the platelet P2Y12 receptor. J Med Chem 51:1007-25 (2008)  
Target
Name:
P2Y purinoceptor 12
Synonyms:
ADP-glucose receptor HORK3 P2T(AC) P2Y(AC) P2Y(cyc) P2Y12 platelet ADP receptor Purinergic receptor P2Y12 | SP1999
Type:
Enzyme
Mol. Mass.:
39458.48
Organism:
Homo sapiens (Human)
Description:
Q9H244
Residue:
342
  
Inhibitor
Name:
BDBM50371570
Synonyms:
CHEMBL1162162
Type:
Small organic molecule
Emp. Form.:
C32H34N4O23P4
Mol. Mass.:
966.5204
SMILES:
OP(=O)(OC[C@H]1O[C@H]([C@@H]2OC(O[C@H]12)c1ccccc1)n1ccc(=O)[nH]c1=O)OP(O)(=O)OP(O)(=O)OP(O)(=O)OC[C@@H]1O[C@@H]([C@H]2OC(O[C@@H]12)c1ccccc1)n1ccc(=O)[nH]c1=O
: