Target
5-hydroxytryptamine receptor 2B
Ligand
BDBM50371670
Substrate
Meas. Tech.
ChEMBL_463839 (CHEMBL934033)
Ki
1±n/a nM
Citation
 Shireman, BTDvorak, CARudolph, DABonaventure, PNepomuceno, DDvorak, LMiller, KLLovenberg, TWCarruthers, NI 2-Alkyl-4-aryl-pyrimidine fused heterocycles as selective 5-HT2A antagonists. Bioorg Med Chem Lett 18:2103-8 (2008)  
Target
Name:
5-hydroxytryptamine receptor 2B
Synonyms:
5-HT-2B 5-hydroxytryptamine (serotonin) receptor 2B [Homo sapiens] 5-hydroxytryptamine receptor 2C (5HT2C) HTR2B Serotonin 2b (5-HT2b) receptor | Serotonin Receptor 2B
Type:
G Protein-Coupled Receptor (GPCR)
Mol. Mass.:
54312.47
Organism:
Homo sapiens (Human)
Description:
Receptor binding assays were performed using human clone stably expressed in CHO cells.
Residue:
481
  
Inhibitor
Name:
BDBM50371670
Synonyms:
CHEMBL272082
Type:
Small organic molecule
Emp. Form.:
C20H25N3
Mol. Mass.:
307.4326
SMILES:
Cc1ccc(cc1)-c1nc(nc2CCNCCc12)C1CCCC1
: