Target
5-hydroxytryptamine receptor 2A
Ligand
BDBM50371682
Substrate
Meas. Tech.
ChEMBL_463838 (CHEMBL934032)
Ki
0.6±n/a nM
Citation
 Shireman, BTDvorak, CARudolph, DABonaventure, PNepomuceno, DDvorak, LMiller, KLLovenberg, TWCarruthers, NI 2-Alkyl-4-aryl-pyrimidine fused heterocycles as selective 5-HT2A antagonists. Bioorg Med Chem Lett 18:2103-8 (2008)  
Target
Name:
5-hydroxytryptamine receptor 2A
Synonyms:
5-HT-2 5-HT2A 5-hydroxytryptamine receptor 2A (5HT-2A) 5HT2A_HUMAN HTR2A | Serotonin receptor 2A
Type:
undefined
Mol. Mass.:
52607.65
Organism:
Homo sapiens (Human)
Description:
P28223
Residue:
471
  
Inhibitor
Name:
BDBM50371682
Synonyms:
CHEMBL270188
Type:
Small organic molecule
Emp. Form.:
C21H20FN3
Mol. Mass.:
333.402
SMILES:
Fc1ccc(cc1)-c1nc(Cc2ccccc2)nc2CCNCCc12
: