Target
P2Y purinoceptor 2
Ligand
BDBM50227019
Substrate
Meas. Tech.
ChEMBL_463988 (CHEMBL929975)
IC50
20000±n/a nM
Citation
 Weyler, SBaqi, YHillmann, PKaulich, MHunder, AMMüller, IAMüller, CE Combinatorial synthesis of anilinoanthraquinone derivatives and evaluation as non-nucleotide-derived P2Y2 receptor antagonists. Bioorg Med Chem Lett 18:223-7 (2008)  
Target
Name:
P2Y purinoceptor 2
Synonyms:
ATP receptor P2U purinoceptor 1 P2Y purinoceptor 2 P2ru1 Purinergic receptor | Purinergic receptor P2Y2
Type:
PROTEIN
Mol. Mass.:
42202.78
Organism:
Mus musculus
Description:
ChEMBL_587770
Residue:
373
  
Inhibitor
Name:
BDBM50227019
Synonyms:
CHEMBL271673 | sodium 1-amino-4-(4-chlorophenylamino)-9,10-dioxo-9,10-dihydroanthracene-2-sulfonate
Type:
Small organic molecule
Emp. Form.:
C20H12ClN2O5S
Mol. Mass.:
427.838
SMILES:
Nc1c(cc(Nc2ccc(Cl)cc2)c2C(=O)c3ccccc3C(=O)c12)S([O-])(=O)=O
: