Target
Gag-Pro polyprotein
Ligand
BDBM50371706
Substrate
Meas. Tech.
ChEMBL_463999 (CHEMBL929986)
IC50
103±n/a nM
Citation
 Nguyen, JTZhang, MKumada, HOItami, ANishiyama, KKimura, TCheng, MHayashi, YKiso, Y Truncation and non-natural amino acid substitution studies on HTLV-I protease hexapeptidic inhibitors. Bioorg Med Chem Lett 18:366-70 (2008)  
Target
Name:
Gag-Pro polyprotein
Synonyms:
Human T-cell leukemia virus type I protease gag-pro | prt
Type:
PROTEIN
Mol. Mass.:
71577.03
Organism:
Human T-cell leukemia virus 1 (strain Japan ATK-1 subtype A) (HTLV-1)
Description:
ChEMBL_303297
Residue:
651
  
Inhibitor
Name:
BDBM50371706
Synonyms:
CHEMBL404702
Type:
Small organic molecule
Emp. Form.:
C40H51N5O6S
Mol. Mass.:
729.928
SMILES:
CC(=O)N[C@H](C(=O)N[C@H](C(=O)N[C@@H](Cc1ccccc1)[C@H](O)C(=O)N1CSC(C)(C)C1C(=O)NCc1ccccc1C)C(C)(C)C)c1ccccc1
: