Target
Fatty-acid amide hydrolase 1
Ligand
BDBM50371969
Substrate
Meas. Tech.
ChEMBL_464389 (CHEMBL930038)
IC50
120±n/a nM
Citation
 Wheelock, CENishi, KYing, AJones, PDColvin, MEOlmstead, MMHammock, BD Influence of sulfur oxidation state and steric bulk upon trifluoromethyl ketone (TFK) binding kinetics to carboxylesterases and fatty acid amide hydrolase (FAAH). Bioorg Med Chem 16:2114-30 (2008)  
Target
Name:
Fatty-acid amide hydrolase 1
Synonyms:
Anandamide amidohydrolase FAAH FAAH1_HUMAN Fatty-acid amide hydrolase (FAAH) Oleamide hydrolase 1
Type:
Protein
Mol. Mass.:
63071.19
Organism:
Homo sapiens (Human)
Description:
O00519
Residue:
579
  
Inhibitor
Name:
BDBM50371969
Synonyms:
CHEMBL270374
Type:
Small organic molecule
Emp. Form.:
C13H23F3OS
Mol. Mass.:
284.381
SMILES:
CCCCCCCCCCSCC(=O)C(F)(F)F
: