Target
5-hydroxytryptamine receptor 2C
Ligand
BDBM50371980
Substrate
Meas. Tech.
ChEMBL_464411 (CHEMBL931076)
Ki
2145±n/a nM
Citation
 Peters, JULübbers, TAlanine, AKolczewski, SBlasco, FSteward, L Cyclic guanidines as dual 5-HT5A/5-HT7 receptor ligands: optimising brain penetration. Bioorg Med Chem Lett 18:262-6 (2008)  
Target
Name:
5-hydroxytryptamine receptor 2C
Synonyms:
5-HT-2C 5-HT2C-INI 5-HTR2C 5-hydroxytryptamine receptor 2C (5-HT-2C) 5HT-1C HTR1C Serotonin (5-HT3) receptor Serotonin Receptor 2C
Type:
G Protein-Coupled Receptor (GPCR)
Mol. Mass.:
51836.79
Organism:
Homo sapiens (Human)
Description:
P28335
Residue:
458
  
Inhibitor
Name:
BDBM50371980
Synonyms:
CHEMBL446459
Type:
Small organic molecule
Emp. Form.:
C14H19F2N3O
Mol. Mass.:
283.317
SMILES:
CC(C)Oc1cccc2C(C)NC(NCC(F)F)=Nc12
: