Target
5-hydroxytryptamine receptor 6
Ligand
BDBM50371998
Substrate
Meas. Tech.
ChEMBL_464434 (CHEMBL930107)
Ki
1028.4±n/a nM
Citation
 Peters, JULübbers, TAlanine, AKolczewski, SBlasco, FSteward, L Cyclic guanidines as dual 5-HT5A/5-HT7 receptor ligands: optimising brain penetration. Bioorg Med Chem Lett 18:262-6 (2008)  
Target
Name:
5-hydroxytryptamine receptor 6
Synonyms:
5-HT-6 5-hydroxytryptamine receptor 6 (5-HT-6) 5-hydroxytryptamine receptor 6 (5HT6) HTR6 Serotonin 6 (5-HT6) receptor | Serotonin Receptor 6
Type:
G Protein-Coupled Receptor (GPCR)
Mol. Mass.:
46968.43
Organism:
Homo sapiens (Human)
Description:
P50406
Residue:
440
  
Inhibitor
Name:
BDBM50371998
Synonyms:
CHEMBL404372
Type:
Small organic molecule
Emp. Form.:
C9H10ClN3
Mol. Mass.:
195.649
SMILES:
C[C@@H]1NC(N)=Nc2cccc(Cl)c12
: