Target
Prostaglandin E2 receptor EP4 subtype
Ligand
BDBM50372064
Substrate
Meas. Tech.
ChEMBL_464678 (CHEMBL934070)
Ki
0.12±n/a nM
Citation
 Burch, JDBelley, MFortin, RDeschênes, DGirard, MColucci, JFarand, JTherien, AGMathieu, MCDenis, DVigneault, ELévesque, JFGagné, SWrona, MXu, DClark, PRowland, SHan, Y Structure-activity relationships and pharmacokinetic parameters of quinoline acylsulfonamides as potent and selective antagonists of the EP(4) receptor. Bioorg Med Chem Lett 18:2048-54 (2008)  
Target
Name:
Prostaglandin E2 receptor EP4 subtype
Synonyms:
PE2R4_HUMAN PGE2 receptor EP4 subtype PTGER4 Prostanoid EP4 receptor
Type:
Enzyme
Mol. Mass.:
53134.53
Organism:
Homo sapiens (Human)
Description:
P35408
Residue:
488
  
Inhibitor
Name:
BDBM50372064
Synonyms:
CHEMBL256873
Type:
Small organic molecule
Emp. Form.:
C34H35N3O8S
Mol. Mass.:
645.722
SMILES:
CCOc1c2CN(C(=O)c2c(OCC)c2cccnc12)c1ccc(CS(=O)(=O)NC(=O)Cc2c(OC)cccc2C(C)=O)cc1C
: