Target
Prostaglandin E2 receptor EP4 subtype
Ligand
BDBM50372068
Substrate
Meas. Tech.
ChEMBL_464679 (CHEMBL934071)
Ki
3.6±n/a nM
Citation
 Burch, JDBelley, MFortin, RDeschênes, DGirard, MColucci, JFarand, JTherien, AGMathieu, MCDenis, DVigneault, ELévesque, JFGagné, SWrona, MXu, DClark, PRowland, SHan, Y Structure-activity relationships and pharmacokinetic parameters of quinoline acylsulfonamides as potent and selective antagonists of the EP(4) receptor. Bioorg Med Chem Lett 18:2048-54 (2008)  
Target
Name:
Prostaglandin E2 receptor EP4 subtype
Synonyms:
PE2R4_HUMAN PGE2 receptor EP4 subtype PTGER4 Prostanoid EP4 receptor
Type:
Enzyme
Mol. Mass.:
53134.53
Organism:
Homo sapiens (Human)
Description:
P35408
Residue:
488
  
Inhibitor
Name:
BDBM50372068
Synonyms:
CHEMBL402162
Type:
Small organic molecule
Emp. Form.:
C32H33N3O7S
Mol. Mass.:
603.685
SMILES:
CCOc1c2C(=O)N(Cc2c(OCC)c2ncccc12)c1ccc(CS(=O)(=O)NC(=O)Cc2ccccc2OC)cc1C
: