Target
Vascular endothelial growth factor receptor 2
Ligand
BDBM50372144
Substrate
Meas. Tech.
ChEMBL_464752 (CHEMBL930118)
IC50
0.6±n/a nM
Citation
 Dai, YHartandi, KSoni, NBPease, LJReuter, DROlson, AMOsterling, DJDoktor, SZAlbert, DHBouska, JJGlaser, KBMarcotte, PAStewart, KDDavidsen, SKMichaelides, MR Identification of aminopyrazolopyridine ureas as potent VEGFR/PDGFR multitargeted kinase inhibitors. Bioorg Med Chem Lett 18:386-90 (2008)  
Target
Name:
Vascular endothelial growth factor receptor 2
Synonyms:
CD_antigen=CD309 Fetal liver kinase 1 (FLK-1) KDR Protein-tyrosine kinase receptor Flk-1 VEGFR-2 VEGFR2 Vascular Endothelial Growth Factor Receptor Kinase 2 Vascular endothelial growth factor receptor 2 (KDR) Vascular endothelial growth factor receptor 2 (VEGFR2) Vascular endothelial growth factor receptor-2 (VEGFR-2)
Type:
Receptor Tyrosine Kinase
Mol. Mass.:
151510.97
Organism:
Homo sapiens (Human)
Description:
P35968
Residue:
1356
  
Inhibitor
Name:
BDBM50372144
Synonyms:
CHEMBL272938
Type:
Small organic molecule
Emp. Form.:
C20H18N6O
Mol. Mass.:
358.3965
SMILES:
Cc1cccc(NC(=O)Nc2ccc(cc2)-c2cncc3[nH]nc(N)c23)c1
: