Target
Nitric oxide synthase, endothelial
Ligand
BDBM50372214
Substrate
Meas. Tech.
ChEMBL_464819 (CHEMBL946888)
IC50
860±n/a nM
Citation
 Le Bourdonnec, BLeister, LKAjello, CACassel, JASeida, PRO'Hare, HGu, MChu, GHTuthill, PADeHaven, RNDolle, RE Discovery of a series of aminopiperidines as novel iNOS inhibitors. Bioorg Med Chem Lett 18:336-43 (2008)  
Target
Name:
Nitric oxide synthase, endothelial
Synonyms:
Constitutive NOS Endothelial NOS NOS type III NOS3_HUMAN Nitric oxide synthase (inducible and endothelial) Nitric-oxide synthase (endothelial and brain) eNOS
Type:
Enzyme Catalytic Domain
Mol. Mass.:
133297.84
Organism:
Homo sapiens (Human)
Description:
P29474
Residue:
1203
  
Inhibitor
Name:
BDBM50372214
Synonyms:
CHEMBL256620
Type:
Small organic molecule
Emp. Form.:
C18H24ClN3
Mol. Mass.:
317.856
SMILES:
CN(Cc1cc(Cl)ccc1C#N)C1CCN(CC2CC2)CC1
: