Target
Nitric oxide synthase, brain
Ligand
BDBM50372233
Substrate
Meas. Tech.
ChEMBL_464820 (CHEMBL946890)
IC50
530±n/a nM
Citation
 Le Bourdonnec, BLeister, LKAjello, CACassel, JASeida, PRO'Hare, HGu, MChu, GHTuthill, PADeHaven, RNDolle, RE Discovery of a series of aminopiperidines as novel iNOS inhibitors. Bioorg Med Chem Lett 18:336-43 (2008)  
Target
Name:
Nitric oxide synthase, brain
Synonyms:
Constitutive NOS NC-NOS NOS type I nNOS NOS1_HUMAN Neuronal nitric oxide synthase Nitric oxide synthase, neuronal (nNOS) bNOS | nNOS
Type:
Homodimer
Mol. Mass.:
160985.98
Organism:
Homo sapiens (Human)
Description:
P29475
Residue:
1434
  
Inhibitor
Name:
BDBM50372233
Synonyms:
CHEMBL436643
Type:
Small organic molecule
Emp. Form.:
C15H20BrN3
Mol. Mass.:
322.243
SMILES:
CN(Cc1cc(Br)ccc1C#N)C1CCN(C)CC1
: