Target
Nitric oxide synthase, inducible
Ligand
BDBM50372223
Substrate
Meas. Tech.
ChEMBL_464823 (CHEMBL946893)
IC50
3300±n/a nM
Citation
 Le Bourdonnec, BLeister, LKAjello, CACassel, JASeida, PRO'Hare, HGu, MChu, GHTuthill, PADeHaven, RNDolle, RE Discovery of a series of aminopiperidines as novel iNOS inhibitors. Bioorg Med Chem Lett 18:336-43 (2008)  
Target
Name:
Nitric oxide synthase, inducible
Synonyms:
HEP-NOS Inducible NO synthase NOS type II NOS2A Nitric oxide synthase, inducible (iNOS) | iNOS
Type:
Homodimer
Mol. Mass.:
131141.95
Organism:
Homo sapiens (Human)
Description:
P35228
Residue:
1153
  
Inhibitor
Name:
BDBM50372223
Synonyms:
CHEMBL428069
Type:
Small organic molecule
Emp. Form.:
C22H26ClN3
Mol. Mass.:
367.915
SMILES:
CN(Cc1cc(Cl)ccc1C#N)C1CCN(CCc2ccccc2)CC1
: