Target
Nitric oxide synthase, inducible
Ligand
BDBM50372212
Substrate
Meas. Tech.
ChEMBL_464818 (CHEMBL946889)
IC50
180±n/a nM
Citation
 Le Bourdonnec, BLeister, LKAjello, CACassel, JASeida, PRO'Hare, HGu, MChu, GHTuthill, PADeHaven, RNDolle, RE Discovery of a series of aminopiperidines as novel iNOS inhibitors. Bioorg Med Chem Lett 18:336-43 (2008)  
Target
Name:
Nitric oxide synthase, inducible
Synonyms:
HEP-NOS Inducible NO synthase NOS type II NOS2A Nitric oxide synthase, inducible (iNOS) | iNOS
Type:
Homodimer
Mol. Mass.:
131141.95
Organism:
Homo sapiens (Human)
Description:
P35228
Residue:
1153
  
Inhibitor
Name:
BDBM50372212
Synonyms:
CHEMBL271248
Type:
Small organic molecule
Emp. Form.:
C14H18ClN3
Mol. Mass.:
263.766
SMILES:
CN(Cc1cc(Cl)ccc1C#N)C1CCCNC1
: