Target
Adenosine receptor A1
Ligand
BDBM50372288
Substrate
Meas. Tech.
ChEMBL_464846 (CHEMBL930563)
Ki
8120±n/a nM
Citation
 González, MPBesada, PGonzález Moa, MJTeijeira, MTerán, C New QSAR combined strategy for the design of A1 adenosine receptor agonists. Bioorg Med Chem 16:1658-75 (2008)  
Target
Name:
Adenosine receptor A1
Synonyms:
AA1R_RAT ADENOSINE A1 high Adenosine A1 receptor (A1) Adenosine receptors A1 | Adora1
Type:
Protein
Mol. Mass.:
36704.13
Organism:
Rattus norvegicus (rat)
Description:
Residue:
326
  
Inhibitor
Name:
BDBM50372288
Synonyms:
CHEMBL272016
Type:
Small organic molecule
Emp. Form.:
C19H19IN6O
Mol. Mass.:
474.2982
SMILES:
CNC(=O)C1CC=CC1n1cnc2c(NCc3ccccc3I)ncnc12
: