Target
Fatty-acid amide hydrolase 1
Ligand
BDBM50372399
Substrate
Meas. Tech.
ChEMBL_464890 (CHEMBL949089)
Ki
0.67±n/a nM
Citation
 Kimball, FSRomero, FAEzzili, CGarfunkle, JRayl, TJHochstatter, DGHwang, IBoger, DL Optimization of alpha-ketooxazole inhibitors of fatty acid amide hydrolase. J Med Chem 51:937-47 (2008)  
Target
Name:
Fatty-acid amide hydrolase 1
Synonyms:
Anandamide amidohydrolase FAAH FAAH1_HUMAN Fatty-acid amide hydrolase (FAAH) Oleamide hydrolase 1
Type:
Protein
Mol. Mass.:
63071.19
Organism:
Homo sapiens (Human)
Description:
O00519
Residue:
579
  
Inhibitor
Name:
BDBM50372399
Synonyms:
CHEMBL405604
Type:
Small organic molecule
Emp. Form.:
C20H16F3NO3
Mol. Mass.:
375.3411
SMILES:
FC(F)(F)c1cnc(o1)C(=O)CCc1ccc(COc2ccccc2)cc1
: