Target
Transcription factor p65
Ligand
BDBM50372522
Substrate
Meas. Tech.
ChEMBL_465172 (CHEMBL945842)
IC50
1100±n/a nM
Citation
 Xie, YDeng, SThomas, CJLiu, YZhang, YQRinderspacher, AHuang, WGong, GWyler, MCayanis, EAulner, NTöbben, UChung, CPampou, SSouthall, NVidovic, DSchürer, SBranden, LDavis, REStaudt, LMInglese, JAustin, CPLandry, DWSmith, DHAuld, DS Identification of N-(quinolin-8-yl)benzenesulfonamides as agents capable of down-regulating NFkappaB activity within two separate high-throughput screens of NFkappaB activation. Bioorg Med Chem Lett 18:329-35 (2008)  
Target
Name:
Transcription factor p65
Synonyms:
NFKB3 Nuclear factor NF-kappa-B p65 subunit TF65_HUMAN | v-rel reticuloendotheliosis viral oncogene homolog A isoform 1
Type:
Enzyme
Mol. Mass.:
60211.92
Organism:
Homo sapiens (Human)
Description:
Q04206
Residue:
551
  
Inhibitor
Name:
BDBM50372522
Synonyms:
CHEMBL269941
Type:
Small organic molecule
Emp. Form.:
C17H12F3N3O4S
Mol. Mass.:
411.355
SMILES:
Cc1ccc2cccc(NS(=O)(=O)c3ccc(cc3[N+]([O-])=O)C(F)(F)F)c2n1
: