Target
Transcription factor p65
Ligand
BDBM50372514
Substrate
Meas. Tech.
ChEMBL_465172 (CHEMBL945842)
IC50
1500±n/a nM
Citation
 Xie, YDeng, SThomas, CJLiu, YZhang, YQRinderspacher, AHuang, WGong, GWyler, MCayanis, EAulner, NTöbben, UChung, CPampou, SSouthall, NVidovic, DSchürer, SBranden, LDavis, REStaudt, LMInglese, JAustin, CPLandry, DWSmith, DHAuld, DS Identification of N-(quinolin-8-yl)benzenesulfonamides as agents capable of down-regulating NFkappaB activity within two separate high-throughput screens of NFkappaB activation. Bioorg Med Chem Lett 18:329-35 (2008)  
Target
Name:
Transcription factor p65
Synonyms:
NFKB3 Nuclear factor NF-kappa-B p65 subunit TF65_HUMAN | v-rel reticuloendotheliosis viral oncogene homolog A isoform 1
Type:
Enzyme
Mol. Mass.:
60211.92
Organism:
Homo sapiens (Human)
Description:
Q04206
Residue:
551
  
Inhibitor
Name:
BDBM50372514
Synonyms:
CHEMBL540966
Type:
Small organic molecule
Emp. Form.:
C15H11N3O4S
Mol. Mass.:
329.331
SMILES:
[O-][N+](=O)c1ccc(cc1)S(=O)(=O)Nc1cccc2cccnc12
: