Target
Beta-secretase 1
Ligand
BDBM50234178
Substrate
Meas. Tech.
ChEMBL_465257 (CHEMBL930527)
IC50
5.6±n/a nM
Citation
 Hamada, YAbdel-Rahman, HYamani, ANguyen, JTStochaj, MHidaka, KKimura, THayashi, YSaito, KIshiura, SKiso, Y BACE1 inhibitors: optimization by replacing the P1' residue with non-acidic moiety. Bioorg Med Chem Lett 18:1649-53 (2008)  
Target
Name:
Beta-secretase 1
Synonyms:
ASP2 Aspartyl protease 2 BACE1 Beta-secretase (BACE) Beta-secretase 1 (BACE 1) Beta-secretase 1 (BACE1) Beta-site amyloid precursor protein cleaving enzyme 1 Memapsin-2 beta-Secretase (BACE-1) | beta-Secretase (BACE1)
Type:
Protein
Mol. Mass.:
55755.10
Organism:
Homo sapiens (Human)
Description:
P56817
Residue:
501
  
Inhibitor
Name:
BDBM50234178
Synonyms:
CHEMBL255838 N-((S)-3-((S)-1-((S)-1-((2S,3R)-4-(3-(2H-tetrazol-5-yl)phenylamino)-3-hydroxy-4-oxo-1-phenylbutan-2-ylamino)-3-cyclohexyl-1-oxopropan-2-ylamino)-3-methyl-1-oxobutan-2-ylamino)-2-amino-3-oxopropyl)-5-fluoro-2,6-dioxo-1,2,3,6-tetrahydropyrimidine-4-carboxamide
Type:
Small organic molecule
Emp. Form.:
C39H49FN12O8
Mol. Mass.:
832.8804
SMILES:
CC(C)[C@H](NC(=O)[C@@H](N)CNC(=O)c1[nH]c(=O)[nH]c(=O)c1F)C(=O)N[C@@H](CC1CCCCC1)C(=O)N[C@@H](Cc1ccccc1)[C@@H](O)C(=O)Nc1cccc(c1)-c1nnn[nH]1
: