Target
Thromboxane-A synthase
Ligand
BDBM50227631
Substrate
Meas. Tech.
ChEMBL_465386 (CHEMBL945934)
IC50
3000±n/a nM
Citation
 Côté, BBoulet, LBrideau, CClaveau, DEthier, DFrenette, RGagnon, MGiroux, AGuay, JGuiral, SMancini, JMartins, EMassé, FMéthot, NRiendeau, DRubin, JXu, DYu, HDucharme, YFriesen, RW Substituted phenanthrene imidazoles as potent, selective, and orally active mPGES-1 inhibitors. Bioorg Med Chem Lett 17:6816-20 (2008)  
Target
Name:
Thromboxane-A synthase
Synonyms:
CYP5 Cytochrome P450 5A1 TBXAS1 TXA synthase TXS Thromboxane A2 Synthase (P450 TxA2) Thromboxane prostanoid Thromboxane-A synthase
Type:
Enzyme
Mol. Mass.:
60524.67
Organism:
Homo sapiens (Human)
Description:
P24557
Residue:
533
  
Inhibitor
Name:
BDBM50227631
Synonyms:
2-(6-chloro-1H-phenanthro[9,10-d]imidazol-2-yl)isophthalonitrile | CHEMBL412099
Type:
Small organic molecule
Emp. Form.:
C23H11ClN4
Mol. Mass.:
378.813
SMILES:
Clc1ccc2c3[nH]c(nc3c3ccccc3c2c1)-c1c(cccc1C#N)C#N
: