Target
Carbonic anhydrase 9
Ligand
BDBM50372659
Substrate
Meas. Tech.
ChEMBL_465607 (CHEMBL951057)
Ki
5.4±n/a nM
Citation
 Wilkinson, BLInnocenti, AVullo, DSupuran, CTPoulsen, SA Inhibition of carbonic anhydrases with glycosyltriazole benzene sulfonamides. J Med Chem 51:1945-53 (2008)  
Target
Name:
Carbonic anhydrase 9
Synonyms:
CA-IX CAH9_HUMAN Carbonic anhydrase 9 (CA IX) Carbonic anhydrase 9 precursor Carbonic anhydrase IX (CAIX) Carbonic anhydrases; II & IX MN RCC-associated antigen G250
Type:
Enzyme
Mol. Mass.:
49669.03
Organism:
Homo sapiens (Human)
Description:
Catalytic domain of human cloned isozyme was used in the assay
Residue:
459
  
Inhibitor
Name:
BDBM50372659
Synonyms:
CHEMBL259682
Type:
Small organic molecule
Emp. Form.:
C14H18N4O7S
Mol. Mass.:
386.38
SMILES:
NS(=O)(=O)c1ccc(cc1)-c1cn(nn1)[C@H]1O[C@H](CO)[C@@H](O)[C@H](O)[C@@H]1O
: