Target
Beta-1 adrenergic receptor
Ligand
BDBM50372691
Substrate
Meas. Tech.
ChEMBL_465622 (CHEMBL951072)
EC50
3.1±n/a nM
Citation
 Imanishi, MTomishima, YItou, SHamashima, HNakajima, YWashizuka, KSakurai, MMatsui, SImamura, EUeshima, KYamamoto, TYamamoto, NIshikawa, HNakano, KUnami, NHamada, KMatsumura, YTakamura, FHattori, K Discovery of a novel series of biphenyl benzoic acid derivatives as potent and selective human beta3-adrenergic receptor agonists with good oral bioavailability. Part I. J Med Chem 51:1925-44 (2008)  
Target
Name:
Beta-1 adrenergic receptor
Synonyms:
ADRB1 ADRB1_HUMAN Beta-1 adrenoceptor | adrenergic Beta1
Type:
G Protein-Coupled Receptor (GPCR)
Mol. Mass.:
51338.40
Organism:
Homo sapiens (Human)
Description:
P08588
Residue:
477
  
Inhibitor
Name:
BDBM50372691
Synonyms:
CHEMBL257106
Type:
Small organic molecule
Emp. Form.:
C23H21Cl2NO3
Mol. Mass.:
430.324
SMILES:
O[C@@H](CNCCc1ccc(c(Cl)c1)-c1ccc(cc1)C(O)=O)c1cccc(Cl)c1
: