Target
Glucocorticoid receptor
Ligand
BDBM50372975
Substrate
Meas. Tech.
ChEMBL_466158 (CHEMBL950162)
Ki
0.5±n/a nM
Citation
 Clark, RDRay, NCWilliams, KBlaney, PWard, SCrackett, PHHurley, CDyke, HJClark, DELockey, PDevos, RWong, MPorres, SSBright, CPJenkins, REBelanoff, J 1H-Pyrazolo[3,4-g]hexahydro-isoquinolines as selective glucocorticoid receptor antagonists with high functional activity. Bioorg Med Chem Lett 18:1312-7 (2008)  
Target
Name:
Glucocorticoid receptor
Synonyms:
GCR_HUMAN GRL Glucocorticoid receptor (GRFP) Nuclear receptor subfamily 3 group C member 1
Type:
Enzyme
Mol. Mass.:
85656.87
Organism:
Homo sapiens (Human)
Description:
P04150
Residue:
777
  
Inhibitor
Name:
BDBM50372975
Synonyms:
CHEMBL270667
Type:
Small organic molecule
Emp. Form.:
C26H28FN3O4S
Mol. Mass.:
497.582
SMILES:
COCCOC[C@@]12CN(CCC1=Cc1c(C2)cnn1-c1ccc(F)cc1)S(=O)(=O)c1ccccc1
: