Target
Integrin alpha-4/beta-7
Ligand
BDBM50373012
Substrate
Meas. Tech.
ChEMBL_466183 (CHEMBL947947)
IC50
4±n/a nM
Citation
 Gong, YKent Barbay, JKimball, ESSantulli, RJCarolyn Fisher, MDyatkin, ABMiskowski, TAHornby, PJHe, W Synthesis and SAR of pyridazinone-substituted phenylalanine amide alpha4 integrin antagonists. Bioorg Med Chem Lett 18:1331-5 (2008)  
Target
Name:
Integrin alpha-4/beta-7
Synonyms:
Integrin α4β7 Integrin alpha-4/beta7 | Integrin alpha4beta7
Type:
Protein Complex
Mol. Mass.:
Description:
The assay uses stably transfected K562 cells expressing human alpha4beta7 integrin.
Components:
This complex has 2 components.
Component 1
Name:
Integrin alpha-4
Synonyms:
CD49 antigen-like family member D CD49d antigen ITA4_HUMAN Integrin alpha-4 Integrin alpha-IV VLA-4 integrin alpha 4 precursor | integrin alpha-4 precursor
Type:
Membrane Protein
Mol. Mass.:
114897.35
Organism:
Homo sapiens (Human)
Description:
P13612
Residue:
1032
  
Component 2
Name:
Integrin beta-7
Synonyms:
ITB7_HUMAN Integrin alpha-4/beta-7 Integrin beta7
Type:
Membrane Protein
Mol. Mass.:
86893.88
Organism:
Homo sapiens (Human)
Description:
P26010
Residue:
798
  
Inhibitor
Name:
BDBM50373012
Synonyms:
CHEMBL409728
Type:
Small organic molecule
Emp. Form.:
C23H22ClN3O7S
Mol. Mass.:
519.955
SMILES:
COc1cnn(C)c(=O)c1-c1ccc(C[C@H](NC(=O)c2ccc(cc2Cl)S(C)(=O)=O)C(O)=O)cc1
: