Target
Sodium-dependent noradrenaline transporter
Ligand
BDBM50373028
Substrate
Meas. Tech.
ChEMBL_466322 (CHEMBL947039)
Ki
1.21±n/a nM
Citation
 Zeng, FJarkas, NStehouwer, JSVoll, RJOwens, MJKilts, CDNemeroff, CBGoodman, MM Synthesis, in vitro characterization, and radiolabeling of reboxetine analogs as potential PET radioligands for imaging the norepinephrine transporter. Bioorg Med Chem 16:783-93 (2008)  
Target
Name:
Sodium-dependent noradrenaline transporter
Synonyms:
Monoamine transporter NET Noradrenaline Transporter (NET) Norepinephrine transporter protein (NET) SLC6A2 Sodium-dependent noradrenaline transporter (NET) | Solute carrier family 6 member 2
Type:
Multi-pass membrane protein
Mol. Mass.:
69337.72
Organism:
Homo sapiens (Human)
Description:
P23975
Residue:
617
  
Inhibitor
Name:
BDBM50373028
Synonyms:
CHEMBL411262
Type:
Small organic molecule
Emp. Form.:
C20H24FNO2S
Mol. Mass.:
361.473
SMILES:
FCCCOc1ccccc1S[C@H]([C@@H]1CNCCO1)c1ccccc1
: