Target
Carboxypeptidase A1
Ligand
BDBM50373036
Substrate
Meas. Tech.
ChEMBL_466366 (CHEMBL932478)
Ki
450±n/a nM
Citation
 Wang, SHWang, SFXuan, WZeng, ZHJin, JYMa, JTian, GR Nitro as a novel zinc-binding group in the inhibition of carboxypeptidase A. Bioorg Med Chem 16:3596-601 (2008)  
Target
Name:
Carboxypeptidase A1
Synonyms:
CBPA1_HUMAN CPA1
Type:
PROTEIN
Mol. Mass.:
47132.61
Organism:
Homo sapiens (Human)
Description:
ChEMBL_1496378
Residue:
419
  
Inhibitor
Name:
BDBM50373036
Synonyms:
CHEMBL259621
Type:
Small organic molecule
Emp. Form.:
C11H12O4
Mol. Mass.:
208.2106
SMILES:
OC(=O)C[C@@H](Cc1ccccc1)C(O)=O
: