Target
Neuronal acetylcholine receptor subunit alpha-7
Ligand
BDBM50373059
Substrate
Meas. Tech.
ChEMBL_466427 (CHEMBL926870)
IC50
12±n/a nM
Citation
 Ng, HJWhittemore, ERTran, MBHogenkamp, DJBroide, RSJohnstone, TBZheng, LStevens, KEGee, KW Nootropic alpha7 nicotinic receptor allosteric modulator derived from GABAA receptor modulators. Proc Natl Acad Sci U S A 104:8059-64 (2007)  
Target
Name:
Neuronal acetylcholine receptor subunit alpha-7
Synonyms:
ACHA7_RAT Cholinergic, Nicotinic Alpha7 Chrna7 Neuronal acetylcholine receptor (alpha7 nAChR) Neuronal acetylcholine receptor subunit alpha-7 Neuronal acetylcholine receptor subunit alpha-7 (nAChR)
Type:
Enzyme
Mol. Mass.:
56502.44
Organism:
Rattus norvegicus (Rat)
Description:
Q05941
Residue:
502
  
Inhibitor
Name:
BDBM50373059
Synonyms:
CHEMBL429317
Type:
Small organic molecule
Emp. Form.:
C19H15Cl2N3O2
Mol. Mass.:
388.247
SMILES:
Cc1cc(on1)C(C=Nc1ccc(Cl)cc1)C(=O)Nc1ccc(Cl)cc1
: