Target
Potassium voltage-gated channel subfamily KQT member 3
Ligand
BDBM50212239
Substrate
Meas. Tech.
ChEMBL_466479 (CHEMBL925895)
IC50
>10000±n/a nM
Citation
 Jarvis, MFHonore, PShieh, CCChapman, MJoshi, SZhang, XFKort, MCarroll, WMarron, BAtkinson, RThomas, JLiu, DKrambis, MLiu, YMcGaraughty, SChu, KRoeloffs, RZhong, CMikusa, JPHernandez, GGauvin, DWade, CZhu, CPai, MScanio, MShi, LDrizin, IGregg, RMatulenko, MHakeem, AGross, MJohnson, MMarsh, KWagoner, PKSullivan, JPFaltynek, CRKrafte, DS A-803467, a potent and selective Nav1.8 sodium channel blocker, attenuates neuropathic and inflammatory pain in the rat. Proc Natl Acad Sci U S A 104:8520-5 (2007)  
Target
Name:
Potassium voltage-gated channel subfamily KQT member 3
Synonyms:
KCNQ (Kv7) potassium channel KCNQ3_HUMAN | Voltage-gated potassium channel subunit Kv7.3
Type:
PROTEIN
Mol. Mass.:
96759.41
Organism:
Homo sapiens (Human)
Description:
ChEMBL_938652
Residue:
872
  
Inhibitor
Name:
BDBM50212239
Synonyms:
5-(4-chlorophenyl)-N-(3,5-dimethoxyphenyl)furan-2-carboxamide CHEMBL250699
Type:
Small organic molecule
Emp. Form.:
C19H16ClNO4
Mol. Mass.:
357.788
SMILES:
COc1cc(NC(=O)c2ccc(o2)-c2ccc(Cl)cc2)cc(OC)c1
: