Target
Glycogen synthase kinase-3 beta
Ligand
BDBM8379
Substrate
Meas. Tech.
ChEMBL_466615 (CHEMBL930273)
IC50
1000±n/a nM
Citation
 Taha, MOBustanji, YAl-Ghussein, MAMohammad, MZalloum, HAl-Masri, IMAtallah, N Pharmacophore modeling, quantitative structure-activity relationship analysis, and in silico screening reveal potent glycogen synthase kinase-3beta inhibitory activities for cimetidine, hydroxychloroquine, and gemifloxacin. J Med Chem 51:2062-77 (2008)  
Target
Name:
Glycogen synthase kinase-3 beta
Synonyms:
GSK-3 beta GSK3B Glycogen synthase kinase 3 beta (GSK3B) Glycogen synthase kinase-3 beta (GSK-3B) Glycogen synthase kinase-3 beta (GSK3B) Glycogen synthase kinase-3beta (GSK3B) | Serine/threonine-protein kinase GSK3B
Type:
Enzyme
Mol. Mass.:
46756.38
Organism:
Homo sapiens (Human)
Description:
P49841
Residue:
420
  
Inhibitor
Name:
BDBM8379
Synonyms:
N-[6-(2,5-difluorophenyl)-1H-indazol-3-yl]cyclopropanecarboxamide | indazole analogue 21
Type:
Small organic molecule
Emp. Form.:
C17H13F2N3O
Mol. Mass.:
313.3014
SMILES:
Fc1ccc(F)c(c1)-c1ccc2c(NC(=O)C3CC3)n[nH]c2c1
: