Target
Glycogen synthase kinase-3 beta
Ligand
BDBM8388
Substrate
Meas. Tech.
ChEMBL_466615 (CHEMBL930273)
IC50
329±n/a nM
Citation
 Taha, MOBustanji, YAl-Ghussein, MAMohammad, MZalloum, HAl-Masri, IMAtallah, N Pharmacophore modeling, quantitative structure-activity relationship analysis, and in silico screening reveal potent glycogen synthase kinase-3beta inhibitory activities for cimetidine, hydroxychloroquine, and gemifloxacin. J Med Chem 51:2062-77 (2008)  
Target
Name:
Glycogen synthase kinase-3 beta
Synonyms:
GSK-3 beta GSK3B Glycogen synthase kinase 3 beta (GSK3B) Glycogen synthase kinase-3 beta (GSK-3B) Glycogen synthase kinase-3 beta (GSK3B) Glycogen synthase kinase-3beta (GSK3B) | Serine/threonine-protein kinase GSK3B
Type:
Enzyme
Mol. Mass.:
46756.38
Organism:
Homo sapiens (Human)
Description:
P49841
Residue:
420
  
Inhibitor
Name:
BDBM8388
Synonyms:
CHEMBL260928 indazole analogue 30
Type:
Small organic molecule
Emp. Form.:
C15H13N3OS
Mol. Mass.:
283.348
SMILES:
O=C(Nc1n[nH]c2cc(ccc12)-c1ccsc1)C1CC1
: