Target
Glycogen synthase kinase-3 beta
Ligand
BDBM8340
Substrate
Meas. Tech.
ChEMBL_466615 (CHEMBL930273)
IC50
425±n/a nM
Citation
 Taha, MOBustanji, YAl-Ghussein, MAMohammad, MZalloum, HAl-Masri, IMAtallah, N Pharmacophore modeling, quantitative structure-activity relationship analysis, and in silico screening reveal potent glycogen synthase kinase-3beta inhibitory activities for cimetidine, hydroxychloroquine, and gemifloxacin. J Med Chem 51:2062-77 (2008)  
Target
Name:
Glycogen synthase kinase-3 beta
Synonyms:
GSK-3 beta GSK3B Glycogen synthase kinase 3 beta (GSK3B) Glycogen synthase kinase-3 beta (GSK-3B) Glycogen synthase kinase-3 beta (GSK3B) Glycogen synthase kinase-3beta (GSK3B) | Serine/threonine-protein kinase GSK3B
Type:
Enzyme
Mol. Mass.:
46756.38
Organism:
Homo sapiens (Human)
Description:
P49841
Residue:
420
  
Inhibitor
Name:
BDBM8340
Synonyms:
6-aryl-pyrazolo[3,4-b]pyridine analogue 4 | N-{6-phenyl-1H-pyrazolo[3,4-b]pyridin-3-yl}cyclopropanecarboxamide
Type:
Small organic molecule
Emp. Form.:
C16H14N4O
Mol. Mass.:
278.3086
SMILES:
O=C(Nc1n[nH]c2nc(ccc12)-c1ccccc1)C1CC1
: