Target
Glycogen synthase kinase-3 beta
Ligand
BDBM8240
Substrate
Meas. Tech.
ChEMBL_466615 (CHEMBL930273)
IC50
481±n/a nM
Citation
 Taha, MOBustanji, YAl-Ghussein, MAMohammad, MZalloum, HAl-Masri, IMAtallah, N Pharmacophore modeling, quantitative structure-activity relationship analysis, and in silico screening reveal potent glycogen synthase kinase-3beta inhibitory activities for cimetidine, hydroxychloroquine, and gemifloxacin. J Med Chem 51:2062-77 (2008)  
Target
Name:
Glycogen synthase kinase-3 beta
Synonyms:
GSK-3 beta GSK3B Glycogen synthase kinase 3 beta (GSK3B) Glycogen synthase kinase-3 beta (GSK-3B) Glycogen synthase kinase-3 beta (GSK3B) Glycogen synthase kinase-3beta (GSK3B) | Serine/threonine-protein kinase GSK3B
Type:
Enzyme
Mol. Mass.:
46756.38
Organism:
Homo sapiens (Human)
Description:
P49841
Residue:
420
  
Inhibitor
Name:
BDBM8240
Synonyms:
3-[(3-hydroxyphenyl)amino]-4-(4-methoxyphenyl)-2,5-dihydro-1H-pyrrole-2,5-dione | 4-arylmaleimide deriv. 6w
Type:
Small organic molecule
Emp. Form.:
C17H14N2O4
Mol. Mass.:
310.3041
SMILES:
COc1ccc(cc1)C1=C(Nc2cccc(O)c2)C(=O)NC1=O
: