Target
Glycogen synthase kinase-3 beta
Ligand
BDBM8276
Substrate
Meas. Tech.
ChEMBL_466615 (CHEMBL930273)
IC50
532±n/a nM
Citation
 Taha, MOBustanji, YAl-Ghussein, MAMohammad, MZalloum, HAl-Masri, IMAtallah, N Pharmacophore modeling, quantitative structure-activity relationship analysis, and in silico screening reveal potent glycogen synthase kinase-3beta inhibitory activities for cimetidine, hydroxychloroquine, and gemifloxacin. J Med Chem 51:2062-77 (2008)  
Target
Name:
Glycogen synthase kinase-3 beta
Synonyms:
GSK-3 beta GSK3B Glycogen synthase kinase 3 beta (GSK3B) Glycogen synthase kinase-3 beta (GSK-3B) Glycogen synthase kinase-3 beta (GSK3B) Glycogen synthase kinase-3beta (GSK3B) | Serine/threonine-protein kinase GSK3B
Type:
Enzyme
Mol. Mass.:
46756.38
Organism:
Homo sapiens (Human)
Description:
P49841
Residue:
420
  
Inhibitor
Name:
BDBM8276
Synonyms:
3-(3-chlorophenyl)-4-{[4-(methylsulfanyl)phenyl]amino}-2,5-dihydro-1H-pyrrole-2,5-dione | 4-arylmaleimide deriv. 6gg
Type:
Small organic molecule
Emp. Form.:
C17H13ClN2O2S
Mol. Mass.:
344.815
SMILES:
CSc1ccc(NC2=C(C(=O)NC2=O)c2cccc(Cl)c2)cc1
: