Target
Farnesyl pyrophosphate synthase
Ligand
BDBM50098380
Substrate
Meas. Tech.
ChEMBL_466620 (CHEMBL924794)
Ki
48.2±n/a nM
Citation
 Dunford, JEKwaasi, AARogers, MJBarnett, BLEbetino, FHRussell, RGOppermann, UKavanagh, KL Structure-activity relationships among the nitrogen containing bisphosphonates in clinical use and other analogues: time-dependent inhibition of human farnesyl pyrophosphate synthase. J Med Chem 51:2187-95 (2008)  
Target
Name:
Farnesyl pyrophosphate synthase
Synonyms:
Dimethylallyltranstransferase FPP synthase FPPS_HUMAN Farnesyl diphosphate synthase Farnesyl diphosphate synthetase Farnesyl pyrophosphate synthetase KIAA1293 | P14324
Type:
Enzyme
Mol. Mass.:
48272.89
Organism:
Homo sapiens (Human)
Description:
P14324
Residue:
419
  
Inhibitor
Name:
BDBM50098380
Synonyms:
(5-Amino-1-hydroxy-1-phosphono-pentyl)-phosphonic acid 5-amino-1-hydroxypentane-1,1-diyldiphosphonic acid CHEMBL298771
Type:
Small organic molecule
Emp. Form.:
C5H15NO7P2
Mol. Mass.:
263.1226
SMILES:
NCCCCC(O)(P(O)(O)=O)P(O)(O)=O
: