Target
Cannabinoid receptor 1
Ligand
BDBM50373120
Substrate
Meas. Tech.
ChEMBL_466890 (CHEMBL935778)
IC50
0.094±n/a nM
Citation
 Lin, LSHa, SBall, RGTsou, NNCastonguay, LADoss, GAFong, TMShen, CPXiao, JCGoulet, MTHagmann, WK Conformational analysis and receptor docking of N-[(1S,2S)-3-(4-chlorophenyl)-2-(3-cyanophenyl)-1-methylpropyl]-2-methyl-2-{[5-(trifluoromethyl)pyridin-2-yl]oxy}propanamide (taranabant, MK-0364), a novel, acyclic cannabinoid-1 receptor inverse agonist. J Med Chem 51:2108-14 (2008)  
Target
Name:
Cannabinoid receptor 1
Synonyms:
CANN6 CB-R CNR CNR1_HUMAN Cannabinoid receptor Cannabinoid receptor 1 (brain)
Type:
G Protein-Coupled Receptor (GPCR)
Mol. Mass.:
52868.96
Organism:
Homo sapiens (Human)
Description:
P21554
Residue:
472
  
Inhibitor
Name:
BDBM50373120
Synonyms:
CHEMBL260977 | MK-0364
Type:
Small organic molecule
Emp. Form.:
C27H28ClN3O2
Mol. Mass.:
461.983
SMILES:
C[C@H](NC(=O)C(C)(C)Oc1ccc(C)cn1)[C@@H](Cc1ccc(Cl)cc1)c1cccc(c1)C#N
: