Target
Pantothenate synthetase
Ligand
BDBM50373138
Substrate
Meas. Tech.
ChEMBL_466900 (CHEMBL935788)
IC50
250±n/a nM
Citation
 Velaparthi, SBrunsteiner, MUddin, RWan, BFranzblau, SGPetukhov, PA 5-tert-butyl-N-pyrazol-4-yl-4,5,6,7-tetrahydrobenzo[d]isoxazole-3-carboxamide derivatives as novel potent inhibitors of Mycobacterium tuberculosis pantothenate synthetase: initiating a quest for new antitubercular drugs. J Med Chem 51:1999-2002 (2008)  
Target
Name:
Pantothenate synthetase
Synonyms:
Chain A, Crystal Structure Of A Pantothenate Synthetase, Apo Enzyme In C2 Space Group Pantothenate synthetase | panC
Type:
Mol. Mass.:
32675.10
Organism:
Mycobacterium tuberculosis (strain ATCC 25618 / H37Rv)
Description:
ChEMBL_102878
Residue:
309
  
Inhibitor
Name:
BDBM50373138
Synonyms:
CHEMBL410040
Type:
Small organic molecule
Emp. Form.:
C27H34N4O4
Mol. Mass.:
478.5833
SMILES:
CC(C)(C)OC(=O)c1ccc(Cn2cc(NC(=O)c3noc4CCC(Cc34)C(C)(C)C)cn2)cc1
: