Target
Pantothenate synthetase
Ligand
BDBM50373146
Substrate
Meas. Tech.
ChEMBL_466900 (CHEMBL935788)
IC50
97±n/a nM
Citation
 Velaparthi, SBrunsteiner, MUddin, RWan, BFranzblau, SGPetukhov, PA 5-tert-butyl-N-pyrazol-4-yl-4,5,6,7-tetrahydrobenzo[d]isoxazole-3-carboxamide derivatives as novel potent inhibitors of Mycobacterium tuberculosis pantothenate synthetase: initiating a quest for new antitubercular drugs. J Med Chem 51:1999-2002 (2008)  
Target
Name:
Pantothenate synthetase
Synonyms:
Chain A, Crystal Structure Of A Pantothenate Synthetase, Apo Enzyme In C2 Space Group Pantothenate synthetase | panC
Type:
Mol. Mass.:
32675.10
Organism:
Mycobacterium tuberculosis (strain ATCC 25618 / H37Rv)
Description:
ChEMBL_102878
Residue:
309
  
Inhibitor
Name:
BDBM50373146
Synonyms:
CHEMBL408197
Type:
Small organic molecule
Emp. Form.:
C22H26N4O2
Mol. Mass.:
378.4674
SMILES:
CC(C)(C)C1CCc2onc(C(=O)Nc3cnn(Cc4ccccc4)c3)c2C1
: