Target
Glutamate receptor 3
Ligand
BDBM50373179
Substrate
Meas. Tech.
ChEMBL_467205 (CHEMBL928076)
EC50
>1000000±n/a nM
Citation
 Pinto, AConti, PDe Amici, MTamborini, LMadsen, UNielsen, BChristesen, TBräuner-Osborne, HDe Micheli, C Synthesis and pharmacological characterization at glutamate receptors of the four enantiopure isomers of tricholomic acid. J Med Chem 51:2311-5 (2008)  
Target
Name:
Glutamate receptor 3
Synonyms:
GRIA3_RAT Glutamate receptor 3 Glutamate-AMPA | Gria3
Type:
Enzyme Catalytic Domain
Mol. Mass.:
100383.57
Organism:
RAT
Description:
Glutamate-AMPA GRIA3 RAT::P19492
Residue:
888
  
Inhibitor
Name:
BDBM50373179
Synonyms:
CHEMBL260327
Type:
Small organic molecule
Emp. Form.:
C5H8N2O4
Mol. Mass.:
160.128
SMILES:
N[C@H]([C@H]1CC(O)=NO1)C(O)=O
: