Target
Mitogen-activated protein kinase 3
Ligand
BDBM50373215
Substrate
Meas. Tech.
ChEMBL_467339 (CHEMBL939934)
IC50
>11000±n/a nM
Citation
 Asano, YKitamura, SOhra, TAso, KIgata, HTamura, TKawamoto, TTanaka, TSogabe, SMatsumoto, SYamaguchi, MKimura, HItoh, F Discovery, synthesis and biological evaluation of isoquinolones as novel and highly selective JNK inhibitors (1). Bioorg Med Chem 16:4715-32 (2008)  
Target
Name:
Mitogen-activated protein kinase 3
Synonyms:
ERK1 Extracellular signal-regulated kinase 1 MAP kinase ERK1 MAPK3/MAPK7 Mitogen-activated protein kinase PRKM3
Type:
Protein
Mol. Mass.:
43136.58
Organism:
Homo sapiens (Human)
Description:
curated by PDB 4QTB
Residue:
379
  
Inhibitor
Name:
BDBM50373215
Synonyms:
CHEMBL259060
Type:
Small organic molecule
Emp. Form.:
C25H20BrNO5S
Mol. Mass.:
526.399
SMILES:
COC(=O)c1c(-c2ccccc2)c2cc(Br)ccc2c(=O)n1Cc1ccc(cc1)S(C)(=O)=O
: