Target
Mitogen-activated protein kinase kinase kinase 1
Ligand
BDBM50373215
Substrate
Meas. Tech.
ChEMBL_467357 (CHEMBL934583)
IC50
>11000±n/a nM
Citation
 Asano, YKitamura, SOhra, TAso, KIgata, HTamura, TKawamoto, TTanaka, TSogabe, SMatsumoto, SYamaguchi, MKimura, HItoh, F Discovery, synthesis and biological evaluation of isoquinolones as novel and highly selective JNK inhibitors (1). Bioorg Med Chem 16:4715-32 (2008)  
Target
Name:
Mitogen-activated protein kinase kinase kinase 1
Synonyms:
M3K1_HUMAN MAPK/ERK kinase kinase 1 MEK Kinase 1 (MEKK1) MEKK1
Type:
Serine/threonine-protein kinase
Mol. Mass.:
164491.32
Organism:
Homo sapiens (Human)
Description:
Residue:
1512
  
Inhibitor
Name:
BDBM50373215
Synonyms:
CHEMBL259060
Type:
Small organic molecule
Emp. Form.:
C25H20BrNO5S
Mol. Mass.:
526.399
SMILES:
COC(=O)c1c(-c2ccccc2)c2cc(Br)ccc2c(=O)n1Cc1ccc(cc1)S(C)(=O)=O
: