Target
Sodium-dependent serotonin transporter
Ligand
BDBM86420
Substrate
Meas. Tech.
ChEMBL_467791 (CHEMBL931355)
IC50
3500±n/a nM
Citation
 Vickers, TDyck, BTamiya, JZhang, MJovic, FGrey, JFleck, BAAparicio, AJohns, MJin, LTang, HFoster, ACChen, C Studies on a series of milnacipran analogs containing a heteroaromatic group as potent norepinephrine and serotonin transporter inhibitors. Bioorg Med Chem Lett 18:3230-5 (2008)  
Target
Name:
Sodium-dependent serotonin transporter
Synonyms:
5-HT Transporter 5HTT SC6A4_HUMAN SLC6A4 Serotonin transporter (5HTT) Sodium-dependent serotonin transporter (SERT) | Solute carrier family 6 member 4
Type:
Multi-pass membrane protein
Mol. Mass.:
70322.51
Organism:
Homo sapiens (Human)
Description:
P31645
Residue:
630
  
Inhibitor
Name:
BDBM86420
Synonyms:
CAS_92623-85-3 NSC_0
Type:
Small organic molecule
Emp. Form.:
C15H22N2O
Mol. Mass.:
246.348
SMILES:
CCN(CC)C(=O)[C@@]1(C[C@@H]1CN)c1ccccc1
: