Target
Sodium-dependent noradrenaline transporter
Ligand
BDBM50373411
Substrate
Meas. Tech.
ChEMBL_467790 (CHEMBL931354)
IC50
8.7±n/a nM
Citation
 Vickers, TDyck, BTamiya, JZhang, MJovic, FGrey, JFleck, BAAparicio, AJohns, MJin, LTang, HFoster, ACChen, C Studies on a series of milnacipran analogs containing a heteroaromatic group as potent norepinephrine and serotonin transporter inhibitors. Bioorg Med Chem Lett 18:3230-5 (2008)  
Target
Name:
Sodium-dependent noradrenaline transporter
Synonyms:
Monoamine transporter NET Noradrenaline Transporter (NET) Norepinephrine transporter protein (NET) SLC6A2 Sodium-dependent noradrenaline transporter (NET) | Solute carrier family 6 member 2
Type:
Multi-pass membrane protein
Mol. Mass.:
69337.72
Organism:
Homo sapiens (Human)
Description:
P23975
Residue:
617
  
Inhibitor
Name:
BDBM50373411
Synonyms:
CHEMBL255449
Type:
Small organic molecule
Emp. Form.:
C15H20N2OS
Mol. Mass.:
276.397
SMILES:
NC[C@@H]1C[C@@]1(C(=O)N(CC=C)C1CC1)c1ccsc1
: