Target
Melanocortin receptor 4
Ligand
BDBM50373476
Substrate
Meas. Tech.
ChEMBL_467905 (CHEMBL925939)
IC50
1.5±n/a nM
Citation
 Guo, LYe, ZUjjainwalla, FSings, HLSebhat, IKHuber, JWeinberg, DHTang, RMacNeil, TTamvakopoulos, CPeng, QMacIntyre, Evan der Ploeg, LHGoulet, MTWyvratt, MJNargund, RP Synthesis and SAR of potent and orally bioavailable tert-butylpyrrolidine archetype derived melanocortin subtype-4 receptor modulators. Bioorg Med Chem Lett 18:3242-7 (2008)  
Target
Name:
Melanocortin receptor 4
Synonyms:
MC4-R Mc4r
Type:
PROTEIN
Mol. Mass.:
36892.87
Organism:
Rattus norvegicus
Description:
ChEMBL_11005
Residue:
332
  
Inhibitor
Name:
BDBM50373476
Synonyms:
CHEMBL255286
Type:
Small organic molecule
Emp. Form.:
C31H40BrClFN3O2
Mol. Mass.:
621.024
SMILES:
CC[C@H](NC(C)=O)c1cc(Cl)ccc1C1CCN(CC1)C(=O)[C@H]1CN(C[C@@H]1c1ccc(Br)cc1F)C(C)(C)C
: