Target
5-hydroxytryptamine receptor 2A
Ligand
BDBM50073805
Substrate
Meas. Tech.
ChEMBL_467935 (CHEMBL951044)
Ki
380±n/a nM
Citation
 Prante, OTietze, RHocke, CLöber, SHübner, HKuwert, TGmeiner, P Synthesis, radiofluorination, and in vitro evaluation of pyrazolo[1,5-a]pyridine-based dopamine D4 receptor ligands: discovery of an inverse agonist radioligand for PET. J Med Chem 51:1800-10 (2008)  
Target
Name:
5-hydroxytryptamine receptor 2A
Synonyms:
5-HT-2 5-HT2 5HT2A_PIG Serotonin 2a (5-HT2a) receptor
Type:
Enzyme Catalytic Domain
Mol. Mass.:
52679.13
Organism:
PIG
Description:
5-HT2 0 0::P50129
Residue:
470
  
Inhibitor
Name:
BDBM50073805
Synonyms:
3-((4-(4-chlorophenyl)piperazin-1-yl)methyl)H-pyrazolo[1,5-a]pyridine 4-(4-Chloro-phenyl)-1-pyrazolo[1,5-a]pyridin-3-ylmethyl-piperazin-1-ium FAUC 113
Type:
Small organic molecule
Emp. Form.:
C18H19ClN4
Mol. Mass.:
326.823
SMILES:
Clc1ccc(cc1)N1CCN(Cc2cnn3ccccc23)CC1
: