Target
Prostaglandin G/H synthase 2
Ligand
BDBM50373567
Substrate
Meas. Tech.
ChEMBL_468017 (CHEMBL947228)
IC50
0.3±n/a nM
Citation
 Orjales, AMosquera, RLópez, BOlivera, RLabeaga, LNúñez, MT Novel 2-(4-methylsulfonylphenyl)pyrimidine derivatives as highly potent and specific COX-2 inhibitors. Bioorg Med Chem 16:2183-99 (2008)  
Target
Name:
Prostaglandin G/H synthase 2
Synonyms:
COX2 Cyclooxygenase 2 (COX-2) Cyclooxygenase-2 (COX-2 AA) Cyclooxygenase-2 (COX-2) PGH2_HUMAN PHS II Prostaglandin E synthase/G/H synthase 2 Prostaglandin-endoperoxide synthase 2
Type:
Enzyme
Mol. Mass.:
69003.89
Organism:
Homo sapiens (Human)
Description:
Recombinant Cox-2 provided by Cayman (Cayman Chemical Co.,Ann Arbor, MI).
Residue:
604
  
Inhibitor
Name:
BDBM50373567
Synonyms:
CHEMBL271173
Type:
Small organic molecule
Emp. Form.:
C18H19N3O3S2
Mol. Mass.:
389.492
SMILES:
CCOc1cc(NCc2cccs2)nc(n1)-c1ccc(cc1)S(C)(=O)=O
: