Target
Peroxisome proliferator-activated receptor delta
Ligand
BDBM50231513
Substrate
Meas. Tech.
ChEMBL_468344 (CHEMBL931807)
EC50
1100±n/a nM
Citation
 Kasuga, JYamasaki, DOgura, KShimizu, MSato, MMakishima, MDoi, THashimoto, YMiyachi, H SAR-oriented discovery of peroxisome proliferator-activated receptor pan agonist with a 4-adamantylphenyl group as a hydrophobic tail. Bioorg Med Chem Lett 18:1110-5 (2008)  
Target
Name:
Peroxisome proliferator-activated receptor delta
Synonyms:
NR1C2 NUCI Nuclear receptor subfamily 1 group C member 2 PPAR-beta PPARD Peroxisome proliferator-activated receptor Peroxisome proliferator-activated receptor delta
Type:
Enzyme
Mol. Mass.:
49910.45
Organism:
Homo sapiens (Human)
Description:
Q03181
Residue:
441
  
Inhibitor
Name:
BDBM50231513
Synonyms:
(+/-)-2-{3-[(4-Adamantan-1-yl-benzoylamino)-methyl]-4-methoxy-benzyl}-butyric acid rac-2-{3-[(4-adamantan-1-yl-benzoylamino)-methyl]-4-methoxy-benzyl}-butyric acid
Type:
Small organic molecule
Emp. Form.:
C30H37NO4
Mol. Mass.:
475.6191
SMILES:
CCC(Cc1ccc(OC)c(CNC(=O)c2ccc(cc2)C23CC4CC(CC(C4)C2)C3)c1)C(O)=O
: