Target
D(3) dopamine receptor
Ligand
BDBM50373713
Substrate
Meas. Tech.
ChEMBL_468371 (CHEMBL931955)
Ki
4900±n/a nM
Citation
 Tietze, RLöber, SHübner, HGmeiner, PKuwert, TPrante, O Discovery of a dopamine D4 selective PET ligand candidate taking advantage of a click chemistry based REM linker. Bioorg Med Chem Lett 18:983-8 (2008)  
Target
Name:
D(3) dopamine receptor
Synonyms:
DOPAMINE D3 DRD3_HUMAN Dopamine D3 receptor (D3) Dopamine receptor Dopamine receptor D3
Type:
Mol. Mass.:
44243.43
Organism:
Homo sapiens (Human)
Description:
Residue:
400
  
Inhibitor
Name:
BDBM50373713
Synonyms:
CHEMBL404888
Type:
Small organic molecule
Emp. Form.:
C20H24ClFN2O2
Mol. Mass.:
378.868
SMILES:
COc1cc(CN2CCN(CC2)c2ccc(Cl)cc2)ccc1OCCF
: