Target
Muscarinic acetylcholine receptor M5
Ligand
BDBM50373840
Substrate
Meas. Tech.
ChEMBL_468553 (CHEMBL930977)
IC50
>150000±n/a nM
Citation
 Lewis, LMSheffler, DWilliams, RBridges, TMKennedy, JPBrogan, JTMulder, MJWilliams, LNalywajko, NTNiswender, CMWeaver, CDConn, PJLindsley, CW Synthesis and SAR of selective muscarinic acetylcholine receptor subtype 1 (M1 mAChR) antagonists. Bioorg Med Chem Lett 18:885-90 (2008)  
Target
Name:
Muscarinic acetylcholine receptor M5
Synonyms:
ACM5_RAT Chrm-5 Muscarinic acetylcholine receptor | Muscarinic acetylcholine receptor M5
Type:
Enzyme Catalytic Domain
Mol. Mass.:
60161.80
Organism:
RAT
Description:
Cholinergic, muscarinic M5 CHRM5 RAT::P08911
Residue:
531
  
Inhibitor
Name:
BDBM50373840
Synonyms:
CHEMBL258281
Type:
Small organic molecule
Emp. Form.:
C16H24ClN3O
Mol. Mass.:
309.834
SMILES:
CCCC(=O)Nc1ccc(N2CCN(CC)CC2)c(Cl)c1
: